☰
AI辅助开发AXI4 VIP:从架构设计到UVM验证组件生成实战
2026/10/31 6:28:15 网站建设 项目流程

1. 项目缘起:为什么我想用 AI 来辅助开发 AXI4 VIP

做数字芯片验证的朋友,对 AXI4 这套总线协议应该都不陌生。它是 ARM 生态里最核心的片上互联协议之一,从 CPU 到 DDR 控制器,从 DMA 到各类加速器,几乎所有的数据搬运都绕不开它。而 AXI4 VIP,也就是 Verification IP,本质上就是一套封装好的、可复用的验证组件,用来模拟 AXI4 主设备或从设备的行为,让验证工程师不用每次都从零写激励和检查逻辑。

我最初接触 AXI4 VIP 是在一个图像处理 SoC 的项目里。当时团队需要验证一个多主多从的互联矩阵,涉及读写通道的乱序完成、Outstanding 事务管理、QoS 优先级调度等一堆特性。手写 Verilog 激励的效率极低,而且每次协议升级或者项目切换,之前的代码几乎要推倒重来。后来引入了商用 VIP,确实省了不少事,但商用 VIP 的授权费用高,定制化能力有限,遇到一些特殊场景还是得自己动手改。

于是我开始琢磨:能不能用 AI 辅助的方式,把 AXI4 VIP 的开发过程标准化、模块化,让验证代码真正成为可复用的工程资产?这个想法在脑子里转了很久,直到最近大模型在代码生成和协议理解上的能力有了明显提升,我才决定认真把这件事落地。

这篇文章就是我这段时间实践的完整记录。我会从整体设计思路讲起,拆解 AXI4 VIP 的核心架构,然后一步步展示如何用 AI 辅助生成 UVM 验证组件,最后分享我在实操中踩过的坑和总结的经验。如果你也在做总线协议验证,或者对 AI 辅助开发感兴趣,这篇内容应该能给你一些直接可用的参考。

2. 整体设计思路:把 VIP 拆成可复用的积木

2.1 为什么选择 UVM 作为基础框架

在决定动手之前,我先花了两天时间梳理技术选型。AXI4 VIP 的实现方式有很多种,可以用纯 SystemVerilog 写激励,也可以用 UVM 搭建完整的验证环境,还可以用 Python 或者 C++ 做高层次建模。我最终选择 UVM,原因有三点。

第一,UVM 是当前业界验证的主流方法论,几乎所有的商用 VIP 都提供 UVM 接口。用 UVM 搭建的 VIP,可以无缝集成到现有的验证环境中,不需要额外做适配层。第二,UVM 的 factory 机制、config_db 机制和 phase 机制,天然适合做可配置、可复用的组件。我可以把 AXI4 VIP 做成一个参数化的 agent,通过配置决定它是 master 还是 slave,支持哪些数据宽度,是否开启乱序完成等。第三,UVM 的 sequence 机制非常适合做激励生成。我可以把 AXI4 的各种事务类型封装成 sequence,然后通过 AI 辅助生成大量的测试用例。

这里插一句,如果你对 UVM 还不熟悉,建议先补一下基础。UVM 的核心概念包括 component、sequence、driver、monitor、scoreboard 等,这些在后面的代码里会反复出现。不需要一开始就精通,但至少要能看懂基本的类结构和连接关系。

2.2 AXI4 VIP 的核心功能模块划分

一个完整的 AXI4 VIP,我把它拆成了五个核心模块。这个划分方式参考了商用 VIP 的常见架构,同时也考虑到了 AI 辅助生成的便利性。

第一个模块是协议接口层。这一层负责处理 AXI4 的物理信号,包括时钟、复位、五通道的握手信号等。它的作用是把协议时序和上层的事务抽象隔离开,让上层不需要关心具体的信号跳变。

第二个模块是事务层。这一层定义了 AXI4 的事务类型,比如读事务、写事务、读写混合事务等。每个事务包含地址、数据、突发长度、突发类型、缓存属性等字段。事务层是 VIP 的核心数据结构,后续的激励生成和结果检查都围绕它展开。

第三个模块是激励生成层。这一层基于 UVM sequence 机制,负责生成各种符合协议规范的激励。激励的复杂度可以从简单的单次读写,到复杂的乱序 Outstanding 事务、窄传输、非对齐传输等。

第四个模块是监测与检查层。这一层包括 monitor 和 scoreboard。Monitor 负责采样接口上的信号,还原成事务;scoreboard 负责比对实际结果和预期结果,发现协议违规或者数据错误。

第五个模块是覆盖率收集层。这一层负责定义和收集功能覆盖率,确保验证的完备性。AXI4 的覆盖率点包括突发长度分布、响应类型分布、地址对齐情况、Outstanding 深度等。

把这五个模块拆清楚之后,我发现 AI 辅助的切入点非常明确:协议接口层和事务层适合用 AI 生成模板代码,激励生成层适合用 AI 批量生成测试用例,监测与检查层适合用 AI 辅助写断言和比对逻辑,覆盖率收集层适合用 AI 生成覆盖组定义。

2.3 AI 辅助开发的边界在哪里

在正式开始之前,我必须先明确一件事:AI 不是万能的,它不能替代你对协议的理解。我试过直接把 AXI4 协议手册丢给大模型,让它生成一个完整的 VIP,结果出来的代码看起来有模有样,但仔细一检查,握手信号的依赖关系搞错了,乱序完成的处理逻辑也有问题。

所以我的做法是:AI 负责生成代码骨架和重复性逻辑,我负责协议语义的正确性和架构设计。具体来说,我会先自己写好核心的接口定义和事务类,然后把一些模式化的代码交给 AI 生成,比如 driver 的 run_phase 模板、monitor 的采样逻辑、scoreboard 的比对框架等。生成之后,我再逐行审查,确保符合协议规范。

这个边界很重要。如果你指望 AI 一键生成一个能直接用的 VIP,大概率会失望。但如果你把 AI 当成一个高效的代码助手,它能帮你省下大量写模板代码的时间,让你专注于真正需要思考的部分。

3. 核心细节解析:AXI4 VIP 的关键实现要点

3.1 接口定义与信号封装

AXI4 的接口信号比较多,我按照五个通道来组织:写地址通道(AW)、写数据通道(W)、写响应通道(B)、读地址通道(AR)、读数据通道(R)。每个通道都有各自的 valid 和 ready 握手信号,这是 AXI4 协议的核心机制。

在 SystemVerilog 里,我定义了一个 interface 来封装这些信号。这里有一个细节需要注意:AXI4 的 valid 和 ready 握手是双向的,master 和 slave 的角色不同,信号的驱动方向也不同。所以我在 interface 里用了 modport 来区分 master 和 slave 的视角。

interface axi4_if #( parameter ADDR_WIDTH = 32, parameter DATA_WIDTH = 64, parameter ID_WIDTH = 4 ) (input logic clk, input logic rst_n); logic [ID_WIDTH-1:0] awid; logic [ADDR_WIDTH-1:0] awaddr; logic [7:0] awlen; logic [2:0] awsize; logic [1:0] awburst; logic awvalid; logic awready; // ... 其他通道信号省略 modport master ( output awid, awaddr, awlen, awsize, awburst, awvalid, input awready ); modport slave ( input awid, awaddr, awlen, awsize, awburst, awvalid, output awready ); endinterface

这段代码看起来简单,但有几个坑我踩过。第一个坑是awsize的编码。AXI4 规定awsize表示每次传输的字节数,编码方式是 2 的幂次。比如3'b010表示 4 字节,3'b011表示 8 字节。如果你直接把它当成字节数用,就会出错。第二个坑是awlen的含义。它表示突发传输的次数减一,所以实际传输次数是awlen + 1。这个减一的细节在写 driver 的时候特别容易搞混。

我让 AI 帮我生成 interface 的时候,特意在提示词里强调了这些编码规则。AI 生成的代码基本正确,但awsize的注释写错了,它把3'b010注释成了 2 字节。所以你看,AI 生成的代码一定要逐行审查,尤其是涉及协议编码的地方。

3.2 事务类的设计与参数化

事务类是 VIP 的核心数据结构。我设计了一个基类axi4_transaction,然后派生出axi4_read_transaction和axi4_write_transaction。这样做的好处是,scoreboard 和 coverage collector 可以基于基类做统一处理,而 driver 可以根据具体类型做不同的驱动逻辑。

事务类的字段包括:事务 ID、地址、数据数组、突发长度、突发类型、响应类型等。这里有一个设计决策:数据数组是用动态数组还是队列?我最终选择了动态数组,因为 AXI4 的突发长度在事务创建时就已经确定,动态数组的固定长度更符合语义。队列虽然更灵活,但在 scoreboard 比对时容易因为长度不一致产生误报。

class axi4_transaction extends uvm_sequence_item; rand bit [ID_WIDTH-1:0] id; rand bit [ADDR_WIDTH-1:0] addr; rand bit [7:0] len; rand bit [2:0] size; rand bit [1:0] burst; rand bit [DATA_WIDTH-1:0] data[]; rand bit [1:0] resp; `uvm_object_utils_begin(axi4_transaction) `uvm_field_int(id, UVM_ALL_ON) `uvm_field_int(addr, UVM_ALL_ON) `uvm_field_array_int(data, UVM_ALL_ON) `uvm_object_utils_end constraint c_len { len inside {[0:15]}; } constraint c_data_size { data.size() == len + 1; } function new(string name = "axi4_transaction"); super.new(name); endfunction endclass

这里有一个约束我特别想提一下:data.size() == len + 1。这个约束保证了数据数组的长度和突发长度一致。如果没有这个约束,AI 生成的随机激励可能会出现数据长度和突发长度不匹配的情况,导致 driver 驱动时数组越界。这个坑我在早期调试时遇到过,仿真直接报错,排查了半天才发现是约束没写全。

另外,uvm_field_array_int这个宏在数据量大的时候会影响性能。如果事务的数据量很大,建议不要用UVM_ALL_ON,而是手动实现do_copy、do_compare等方法。这个优化我在后面的性能调优章节会详细讲。

3.3 Driver 的驱动逻辑与握手处理

Driver 是 VIP 里最复杂的部分之一,因为它要严格遵循 AXI4 的握手协议。AXI4 的握手规则是:valid 和 ready 同时为高时,传输发生。valid 不能等待 ready 才拉高,但 ready 可以等待 valid。这个规则看似简单,但在实现时有很多细节。

以写地址通道为例,driver 的驱动逻辑是:先把awvalid拉高,然后等待awready。如果awready在当前周期为高,传输完成;如果为低,保持awvalid和地址信号不变,直到awready为高。这里的关键是,地址信号在awvalid拉高之后必须保持稳定,不能中途变化。

task axi4_driver::drive_write_address(axi4_transaction tr); vif.awid <= tr.id; vif.awaddr <= tr.addr; vif.awlen <= tr.len; vif.awsize <= tr.size; vif.awburst <= tr.burst; vif.awvalid <= 1'b1; @(posedge vif.clk); while (vif.awready !== 1'b1) begin @(posedge vif.clk); end vif.awvalid <= 1'b0; endtask

这段代码看起来没问题,但有一个隐藏的坑:while循环里的@(posedge vif.clk)和外面的@(posedge vif.clk)可能会导致时序偏移。如果awready在第一个时钟沿之后才拉高,循环会多等一个周期。这个偏移在单次传输时影响不大,但在 Outstanding 事务场景下会导致性能下降。

我后来改成了用do-while循环,并且把采样点放在时钟沿之前,确保每个周期都能正确判断awready的状态。这个修改让仿真速度提升了大约 15%,虽然不多,但在大规模回归测试时还是很可观的。

AI 在生成 driver 代码时,通常会给出一个基本正确的框架,但握手时序的细节需要你自己调整。我的建议是,生成之后一定要用波形图验证,确保每个信号的跳变都符合协议规范。

3.4 Monitor 的采样与事务还原

Monitor 的作用是监测接口上的信号,把信号跳变还原成事务。它的实现难点在于,如何正确地识别事务的边界。对于写事务,monitor 需要同时监测 AW、W、B 三个通道;对于读事务,需要监测 AR 和 R 两个通道。

我的做法是,为每个通道写一个独立的采样任务,然后用 fork-join 并行执行。当检测到awvalid和awready同时为高时,记录地址和控制信息;当检测到wvalid和wlast同时为高时,记录数据;当检测到bvalid和bready同时为高时,记录响应。最后把这些信息组装成一个完整的事务,发送给 scoreboard。

这里有一个细节:AXI4 允许写数据通道的wvalid在awvalid之前拉高,也允许写响应通道的bvalid在写数据完成之前拉高。所以 monitor 不能假设通道之间的顺序,必须用独立的状态机来跟踪每个通道的状态。

task axi4_monitor::monitor_write_channel(); forever begin @(posedge vif.clk); if (vif.awvalid && vif.awready) begin axi4_transaction tr = axi4_transaction::type_id::create("tr"); tr.id = vif.awid; tr.addr = vif.awaddr; tr.len = vif.awlen; tr.size = vif.awsize; tr.burst = vif.awburst; // 继续采集数据通道和响应通道 collect_write_data(tr); collect_write_response(tr); ap.write(tr); end end endtask

AI 生成的 monitor 代码通常会把所有通道的采样逻辑写在一个forever块里,这样会导致通道之间的耦合。我建议拆成独立的任务,用fork-join_none并行执行。这样不仅逻辑更清晰,而且当某个通道出现异常时,不会影响其他通道的采样。

3.5 Scoreboard 的比对策略

Scoreboard 是验证正确性的最后一道防线。它的核心任务是:接收 monitor 发送的事务,和预期的事务做比对。对于 AXI4 VIP,比对的内容包括地址、数据、响应类型等。

我的 scoreboard 实现了一个关联数组,用事务 ID 作为键,存储预期的事务。当 monitor 发送实际事务时,从关联数组里取出对应的预期事务,逐字段比对。如果比对失败,报 UVM_ERROR。

这里有一个难点:AXI4 允许乱序完成,所以实际事务的到达顺序可能和预期顺序不一致。如果直接用队列做 FIFO 比对,会误报大量错误。用关联数组按 ID 匹配,可以很好地解决这个问题。

class axi4_scoreboard extends uvm_scoreboard; `uvm_component_utils(axi4_scoreboard) axi4_transaction expected_queue[$]; axi4_transaction expected_by_id[int]; function void write(axi4_transaction tr); if (expected_by_id.exists(tr.id)) begin axi4_transaction exp = expected_by_id[tr.id]; if (!tr.compare(exp)) begin `uvm_error("SCB", $sformatf("Transaction mismatch for ID %0d", tr.id)) end expected_by_id.delete(tr.id); end else begin `uvm_error("SCB", $sformatf("Unexpected transaction ID %0d", tr.id)) end endfunction endclass

这个比对策略有一个前提:事务 ID 必须是唯一的。如果同一个 ID 被多个事务复用,关联数组会覆盖之前的数据。所以在激励生成时,我加了一个约束,确保在 Outstanding 窗口内,事务 ID 不重复。这个约束在 AI 生成激励时特别重要,因为 AI 默认不会考虑 ID 的唯一性。

4. 实操过程:用 AI 辅助生成 VIP 的完整流程

4.1 环境准备与工具选型

在开始之前,你需要准备好以下环境。仿真器我用的是 Synopsys VCS,这是业界最常用的数字仿真工具之一。UVM 库用的是 UVM 1.2,这是目前最稳定的版本。AI 辅助工具我用的是一个大语言模型,支持代码生成和上下文理解。

如果你用的是其他仿真器,比如 Cadence Xcelium 或者 Mentor Questa,基本流程是一样的,只需要调整编译选项。UVM 的版本建议用 1.2 或者 1.1d,这两个版本兼容性最好。

环境准备好之后,先建一个干净的目录结构。我的目录结构是这样的:

axi4_vip/ ├── rtl/ # 协议接口和断言 ├── vip/ # VIP 核心代码 │ ├── agent/ │ ├── driver/ │ ├── monitor/ │ ├── sequencer/ │ └── scoreboard/ ├── tests/ # 测试用例 ├── sim/ # 仿真脚本 └── docs/ # 文档和 AI 提示词记录

这个结构的好处是,VIP 代码和测试代码分离,方便复用。当你切换到新项目时,只需要把vip/目录拷贝过去,稍微调整配置参数就能用。

4.2 用 AI 生成协议接口层代码

协议接口层的代码比较模式化,适合用 AI 生成。我的提示词是这样的:

请用 SystemVerilog 生成一个 AXI4 接口定义,参数包括地址宽度 32 位、数据宽度 64 位、ID 宽度 4 位。需要包含 AW、W、B、AR、R 五个通道的所有信号,以及 master 和 slave 的 modport 定义。注意 awsize 的编码规则是 2 的幂次,awlen 表示突发次数减一。

AI 生成的代码基本符合要求,但有几个地方需要修正。第一,它把awsize的注释写成了字节数,实际应该是编码值。第二,它漏掉了awlock和awcache信号,这两个信号在 AXI4 里是可选的,但为了兼容性最好加上。第三,modport 的方向定义有一处错误,awready在 master 侧应该是 input,它写成了 output。

修正之后,我把 interface 代码保存到rtl/axi4_if.sv。这里建议加一个简单的编译测试,确保 interface 能独立编译通过。不要等到整个 VIP 写完再编译,那样排查错误会很痛苦。

4.3 用 AI 生成事务类和序列库

事务类的代码我也让 AI 生成了初版,然后手动调整。提示词里我强调了几个关键点:需要 rand 修饰符、需要 UVM 字段注册宏、需要约束保证数据长度和突发长度一致。

AI 生成的事务类有一个问题:它用了uvm_field_array_int来注册数据数组,但没有考虑数据量大的情况。我后来改成了手动实现do_copy和do_compare,性能提升很明显。具体来说,当数据数组长度超过 256 时,uvm_field_array_int的复制和比对时间会显著增加,而手动实现的版本几乎不受影响。

序列库的生成是 AI 辅助最有价值的部分。我让 AI 根据 AXI4 的协议特性,生成了以下几类 sequence:

  • 基础读写 sequence:单次读、单次写、读写交替
  • 突发传输 sequence:固定长度突发、增量突发、回绕突发
  • 乱序完成 sequence:多个 Outstanding 事务,响应顺序打乱
  • 边界场景 sequence:最大突发长度、最小突发长度、非对齐地址

AI 生成的 sequence 代码框架是正确的,但激励的随机分布需要调整。比如,它默认的突发长度分布是均匀分布,但实际验证中,长突发的覆盖率更重要。我改成了带权重的分布,让长突发的生成概率更高。

4.4 用 AI 辅助写断言和覆盖组

断言和覆盖组是验证完备性的关键。我让 AI 根据 AXI4 协议规范,生成了一组 SystemVerilog 断言。这些断言覆盖了握手协议、突发边界、响应类型等关键场景。

比如,有一个断言检查awvalid拉高之后,地址信号必须保持稳定直到握手完成:

property p_awaddr_stable; @(posedge clk) disable iff (!rst_n) $rose(awvalid) |-> $stable(awaddr) until_with awready; endproperty a_awaddr_stable: assert property(p_awaddr_stable) else `uvm_error("ASSERT", "AWADDR changed before handshake")

AI 生成的断言逻辑基本正确,但有一个细节需要调整:until_with的用法。until_with表示在awready为高之前,awaddr必须保持稳定,且awready为高的那个周期也要求稳定。这个语义是正确的,但有些仿真器对until_with的支持不一致,建议改成until加一个额外的检查。

覆盖组方面,AI 生成的覆盖点包括突发长度、突发类型、响应类型、地址对齐等。我补充了几个项目特定的覆盖点,比如 Outstanding 深度、QoS 优先级组合等。覆盖组定义好之后,一定要跑一次仿真,确认覆盖点能被正常采样。我遇到过覆盖点定义了但采样不到的情况,排查发现是采样时钟用错了。

4.5 集成测试与回归验证

所有模块写完之后,就是集成测试。我建了一个顶层测试环境,把 agent、scoreboard、coverage collector 连接起来,然后跑了一个基础的读写测试。第一次跑的时候,仿真直接挂掉了,报了一堆 UVM_ERROR。

排查过程是这样的:先看错误信息,发现是 scoreboard 报的事务不匹配。然后打开波形图,发现 monitor 采样到的事务数据不对。继续追查,发现是 driver 驱动数据通道时,wlast信号的生成逻辑有问题。AXI4 规定wlast必须在最后一个数据拍拉高,但我的 driver 在第一个数据拍就拉高了。

这个问题其实是 AI 生成的代码里的一个 bug。AI 把wlast的生成逻辑写成了wvalid && (count == 0),正确的应该是wvalid && (count == len)。修正之后,仿真通过了。

集成测试通过之后,我跑了一个简单的回归测试,包含 20 个测试用例。回归结果显示,功能覆盖率达到了 85%,但有几个覆盖点没有覆盖到。分析后发现,这些覆盖点需要特定的激励组合才能触发,比如同时满足最大突发长度和非对齐地址。我补充了几个定向测试用例,覆盖率提升到了 95% 以上。

5. 常见问题与排查技巧实录

5.1 握手信号死锁的排查思路

握手死锁是 AXI4 VIP 调试中最常见的问题。表现是仿真卡住,波形上 valid 和 ready 都是高,但传输就是不完成。这种情况通常是握手逻辑写错了。

我的排查步骤是这样的:第一步,确认 valid 和 ready 的驱动源。用波形图查看这两个信号分别由哪个模块驱动。第二步,检查驱动逻辑里有没有循环等待。比如,driver 在等 ready,而 ready 的生成逻辑又在等 valid,这就形成了死锁。第三步,检查时钟域。如果 valid 和 ready 在不同的时钟域,需要做跨时钟域处理。

我遇到过一次死锁,原因是 monitor 的采样逻辑里有一个wait语句,等待一个永远不会满足的条件。这个wait语句阻塞了 monitor 的后续采样,导致 scoreboard 收不到事务,仿真看起来像是卡住了。后来把wait改成了带超时的fork-join,问题解决。

5.2 事务比对失败的常见原因

Scoreboard 报事务比对失败,原因可能有很多。我整理了一个速查表,方便快速定位。

错误现象可能原因排查方法
数据不匹配driver 驱动数据时字节序错误检查大小端配置
地址不匹配地址对齐处理错误检查 addr 的位宽和掩码
响应类型不匹配slave 响应生成逻辑错误检查 resp 的约束
事务 ID 不匹配ID 复用导致关联数组覆盖检查 ID 唯一性约束
事务数量不匹配monitor 漏采样或重复采样检查采样条件

这个表格是我在实际调试中总结出来的,大部分比对失败都能在里面找到对应原因。其中事务 ID 复用的问题最隐蔽,因为仿真不会报错,只是比对结果不对。后来我在 scoreboard 里加了一个检查,如果同一个 ID 在短时间内出现多次,就报一个 warning,提醒可能有问题。

5.3 覆盖率收敛的加速技巧

覆盖率收敛是验证后期最耗时的环节。我的经验是,不要等到最后才看覆盖率,而是每跑一轮回归就分析一次。这样能及时发现覆盖盲区,调整激励策略。

加速覆盖率收敛的几个技巧:第一,用覆盖率的反馈来指导激励生成。比如,如果发现长突发的覆盖率低,就调整 sequence 的权重,增加长突发的生成概率。第二,用定向测试补充随机测试的盲区。随机测试擅长覆盖大范围,但一些边界场景需要定向测试。第三,用 AI 辅助分析覆盖率报告。我把覆盖率报告丢给 AI,让它找出未覆盖的覆盖点,并建议可能的激励组合。AI 的建议不一定都对,但能提供一些思路。

我试过用 AI 分析覆盖率报告,它指出了几个我忽略的覆盖点,比如同时满足回绕突发和非对齐地址的场景。我根据它的建议补充了定向测试,覆盖率很快收敛了。

5.4 AI 生成代码的审查要点

AI 生成的代码不能直接用,必须经过审查。我总结了几个审查要点,每次生成代码后都按这个清单过一遍。

第一,检查协议编码。AXI4 有很多编码规则,比如awsize的 2 的幂次编码、awlen的减一编码、awburst的三种类型编码。AI 经常在这些地方出错。

第二,检查信号方向。Master 和 slave 的信号驱动方向是相反的,AI 有时会搞混。特别是 modport 定义,一定要仔细核对。

第三,检查时序逻辑。AI 生成的时序逻辑通常是基于理想情况的,没有考虑握手等待、时钟偏移等实际因素。需要手动补充等待逻辑和同步处理。

第四,检查约束完整性。AI 生成的约束可能遗漏一些关键条件,比如数据长度和突发长度的一致性、ID 的唯一性等。需要根据协议规范补充完整。

第五,检查性能影响。AI 生成的代码可能用了低效的数据结构或宏,比如uvm_field_array_int。在大数据量场景下,需要手动优化。

这个审查清单我用了几个月,基本上能覆盖大部分 AI 生成代码的问题。审查一遍大概需要 10 到 15 分钟,但能避免后面几个小时的调试时间,非常值得。

6. 把 VIP 变成可复用工程资产的几个关键决策

6.1 参数化设计的粒度控制

VIP 的可复用性,很大程度上取决于参数化设计的粒度。参数化太粗,复用性差;参数化太细,配置复杂度高。我的经验是,把参数分成三个层次。

第一个层次是协议参数,包括地址宽度、数据宽度、ID 宽度、突发长度范围等。这些参数在 VIP 实例化时确定,之后不再改变。第二个层次是配置参数,包括是否开启乱序完成、是否检查协议违规、覆盖率收集的详细程度等。这些参数可以在仿真运行时通过 config_db 动态设置。第三个层次是激励参数,包括突发长度的分布、地址的分布、响应类型的分布等。这些参数在 sequence 里通过约束控制。

这种分层设计的好处是,协议参数保证了 VIP 的通用性,配置参数提供了灵活性,激励参数支持场景定制。我在多个项目里复用了这套 VIP,只需要调整配置参数和激励参数,协议参数基本不用动。

6.2 目录结构与命名规范

可复用的工程资产,必须有清晰的目录结构和统一的命名规范。我的目录结构在前面已经展示过了,这里重点说命名规范。

文件命名方面,我统一用axi4_前缀,比如axi4_if.sv、axi4_driver.sv、axi4_monitor.sv。类命名方面,用axi4_前缀加类类型,比如axi4_transaction、axi4_driver、axi4_monitor。信号命名方面,遵循 AXI4 协议的小写命名,比如awvalid、awready、rdata。

命名规范看起来是小事,但在团队协作和长期维护中非常重要。我接手过一个项目,VIP 代码里的命名五花八门,有的用驼峰,有的用下划线,有的用缩写,读起来非常费劲。后来我花了两天时间统一了命名,代码的可读性提升了很多。

6.3 文档与 AI 提示词的版本管理

文档是工程资产的重要组成部分。我为 VIP 写了三份文档:用户手册、集成指南和 AI 提示词记录。用户手册介绍 VIP 的功能和配置方法,集成指南说明如何把 VIP 集成到现有验证环境,AI 提示词记录保存了生成代码时用的提示词和修正记录。

AI 提示词的版本管理特别重要。因为 AI 生成的代码质量不稳定,同样的提示词在不同时间可能生成不同的结果。我把每次生成的代码和对应的提示词都保存下来,标注哪些地方需要修正。这样下次生成类似代码时,可以直接参考之前的提示词和修正记录,提高效率。

我用的版本管理工具是 Git,每次修改都提交一次,commit message 写清楚修改内容和原因。这样即使过了几个月,也能追溯代码的演变过程。

6.4 跨项目复用的适配层设计

VIP 在不同项目之间复用时,最大的障碍是接口差异。比如,有的项目用 32 位地址,有的用 64 位;有的项目用 64 位数据,有的用 128 位。如果每次复用都要改 VIP 代码,就失去了复用的意义。

我的做法是加一个适配层。适配层负责把项目的具体接口转换成 VIP 的标准接口。比如,如果项目的地址是 64 位,而 VIP 默认是 32 位,适配层就做一个位宽转换。如果项目的时钟频率不同,适配层就做一个时钟域转换。

适配层的代码通常比较简单,但能大幅提升 VIP 的复用性。我在最近三个项目里都用了适配层,VIP 核心代码一行没改,只改了适配层的配置参数,就完成了集成。

7. 我在这套流程里踩过的坑和总结的经验

7.1 AI 生成代码的“幻觉”问题

AI 生成代码时,有时会“幻觉”出一些不存在的信号或方法。比如,它生成了一段代码,调用了一个axi4_transaction::get_burst_type()方法,但这个方法在事务类里根本没有定义。这种错误在编译时会被发现,但排查起来比较费时间。

我的应对策略是,生成代码后先做一次语法检查,用仿真器的编译命令跑一遍,把语法错误先修掉。然后再做功能检查,用波形图验证逻辑是否正确。两步分开做,比一次性调试效率高很多。

另外,AI 有时会生成一些看起来合理但实际错误的逻辑。比如,它把 AXI4 的写响应通道和读数据通道的握手逻辑搞混了。这种错误编译不会报,但仿真会出错。所以功能检查不能省,一定要用波形图确认每个信号的跳变。

7.2 仿真性能优化的几个实用技巧

VIP 的仿真性能直接影响回归测试的时间。我总结了几个优化技巧,效果比较明显。

第一个技巧是减少uvm_field_*宏的使用。这些宏虽然方便,但性能开销大。对于数据量大的事务类,手动实现do_copy、do_compare、do_print等方法,性能可以提升 30% 以上。

第二个技巧是用fork-join_none替代fork-join。在 monitor 和 driver 里,很多任务是并行执行的,用fork-join_none可以避免不必要的等待。但要注意,fork-join_none里的任务如果访问共享资源,需要加保护。

第三个技巧是优化覆盖率收集的频率。覆盖率收集本身有开销,如果每个事务都收集一次,性能影响很大。我改成了每 100 个事务收集一次,覆盖率精度基本不受影响,但仿真速度提升了 20% 左右。

7.3 团队协作中的 AI 辅助规范

如果团队里多个人都在用 AI 辅助开发,需要制定一些规范,否则代码风格会混乱。我们团队的做法是:统一提示词模板、统一代码审查清单、统一版本管理流程。

提示词模板方面,我们定义了几个标准模板,比如生成 interface 的模板、生成 transaction 的模板、生成 sequence 的模板。每个人用模板生成代码,风格基本一致。

代码审查清单方面,就是我们前面提到的那个审查清单,每个人生成代码后都要按清单过一遍,确保没有遗漏。

版本管理方面,AI 生成的代码和手动修改的代码分开提交,commit message 里标注哪些是 AI 生成的,哪些是手动修改的。这样追溯起来比较方便。

这套规范执行了几个月,团队的代码质量明显提升,AI 辅助的效率也更高了。因为大家用同样的模板和清单,生成的代码可以直接互相复用,不需要额外做适配。

7.4 后续扩展的方向

这套 AXI4 VIP 目前已经稳定运行了几个项目,但还有一些可以扩展的方向。第一个方向是支持 AXI5 协议。AXI5 在 AXI4 的基础上增加了一些新特性,比如原子操作、缓存提示等。VIP 的架构已经预留了扩展接口,增加 AXI5 支持的工作量不大。

第二个方向是集成 AI 根因定位。当仿真报错时,AI 可以分析日志和波形,自动定位问题原因。这个方向我还在探索,目前的做法是把错误日志丢给 AI,让它给出可能的原因和排查建议。准确率大概在 70% 左右,还需要进一步优化。

第三个方向是支持多 AI 协作。不同的 AI 模型在不同的任务上表现不同,有的擅长生成代码,有的擅长分析日志。我在尝试把多个 AI 模型组合起来,各取所长。这个方向比较新,目前还在实验阶段。

这套 VIP 的代码我已经整理成了内部文档,团队里新来的验证工程师可以直接参考。从零开始搭建一个 AXI4 VIP,大概需要两周时间;用这套 AI 辅助流程,时间可以压缩到三到四天。而且生成的代码质量更稳定,因为审查清单和提示词模板都是经过验证的。

如果你也在做总线协议验证,建议从一个小规模的 VIP 开始尝试,比如 APB 或者 AHB,熟悉了 AI 辅助的流程之后,再扩展到 AXI4 这种复杂的协议。不要一上来就搞大而全的 VIP,那样容易在细节里迷失方向。先把一个通道的读写逻辑跑通,再逐步增加乱序完成、Outstanding 管理等高级特性。每增加一个特性,就跑一次回归测试,确保没有引入新的问题。

需要专业的网站建设服务?

联系我们获取免费的网站建设咨询和方案报价,让我们帮助您实现业务目标

立即咨询