☰
Xilinx FPGA SRIO例程拆解:从协议分层到DSP联调与调试实战
2026/10/20 21:31:16 网站建设 项目流程

简介:面向 Xilinx FPGA 开发者,SRIO(Serial RapidIO)使用例程包提供了从协议理解到硬件验证的完整参考。针对 Spartan6 系列集成的 SRIO 硬核,例程包含配置代码、测试平台、仿真模型与 HDL 源码,覆盖端口速率设置、时钟分频、数据收发、错误检测等关键环节,适合正在设计高速互连、通信系统或嵌入式处理平台的工程师直接借鉴和复用。压缩包约 55.91MB,共 2000 个文件,以 didat、obj、c、v、vhd 等源工程文件为主,同时带有 ucf/xdc 约束、bit 下载文件、tcl 脚本及仿真波形配置,这些材料可支撑从综合布局布线到板级调试的完整流程。目前已有 3810 人学习,内容组织贴近真实工程目录,便于按模块查找和对照实验。通过初始化序列、QoS 配置与时序约束要点的梳理,可有效避免 SRIO 调试中的常见问题,帮助缩短基于 FPGA 的高速数据传输方案开发周期。

1. Xilinx FPGA的SRIO例程,为什么值得从头到尾拆一遍

做DSP+FPGA协同处理的人,十有八九绕不开SRIO(Serial RapidIO)。Xilinx FPGA的SRIO使用例程,说白了一件事:把RapidIO协议栈的IP核、端点逻辑、初始化状态机和与DSP握手的完整工程骨架一次性给齐。我当年第一次接触SRIO时最痛苦的不是协议看不懂,而是Vivado里那个IP核一堆端口,不知道哪个信号该接哪、复位时序怎么给、链路up了之后如何发起第一笔读事务。这套例程解决的就是这个问题——它把「从建工程到和DSP对上话」的完整路径走通,你拿到手可以不复现选型过程,直接改地址映射和寄存器定义就能用。适合正在用K7、V7或A7做高速串行通信的开发者,也适合想快速验证SRIO链路可靠性但不想从零啃协议栈的工程师。接下来我用五章的篇幅,把例程的协议基础、代码结构、联调方法和踩过的坑一次讲透。

2. 协议分层与IP核设计:把SRIO当包引擎,而不是当总线用

2.1 逻辑层、传输层、物理层各自管什么事

SRIO和AXI、PCIe这类并行总线最大的区别在于,它不是「主从共享总线」模型,而是「端点之间交换数据包」。在FPGA内部实现时,我习惯把它理解成一个高速包收发引擎:上层逻辑构造请求包/解析响应包,物理层负责串行收发和链路训练,中间传输层只关心源ID和目的ID的路由。这三层对应到RapidIO协议栈里的逻辑层(Logical Layer)、传输层(Transport Layer)和物理层(Physical Layer)。

逻辑层定义了实际操作类型,这套例程里最常见的几个是:NREAD(读内存,需要目的端响应)、NWRITE(写内存,不需要响应)、SWRITE(流式写,效率最高)、DOORBELL(门铃,本质是一个16bit信息的通知事件)。传输出错和内存访问错误则通过错误管理包处理。传输层只有两个字段值得关注:源Device ID和目标Device ID,FPGA作为端点时ID要在例程里手动配好,和DSP侧的ID不能冲突。物理层负责8B/10B编码(Gen2标准下)、串行收发、链路初始化和通道对齐——这几件事不需要用户逻辑干预,但链路训练状态必须由用户逻辑检测,因为数据收发要等链路真正up之后才能发起。

这套例程里也因此把逻辑层做成了AXI-Stream接口,物理层直接挂在GTX/GTH Transceiver上。你不需要理解编码细节,但你要知道:FPGA侧发起的SRIO事务在例程里表现为往一组AXI-Stream信号上按包格式写入数据。这种设计让熟悉AXI的人上手很快,但也容易让人忽略一个关键点——SRIO包的格式不是按bit而是按字对齐的,而且包头长度和payload长度会因操作类型变化。

2.2 IP核关键参数:链路宽度、速率、参考时钟一次选对

在Vivado里添加Serial RapidIO Gen2 IP核时,有两类参数最影响后续使用:链路参数和参考时钟。链路参数包括通道数(1x/2x/4x)和每通道波特率(支持1.25G、2.5G、3.125G、5.0G、6.25G等)。波特率不是选得越高越好——它受PCB板材、连接器质量和FPGA速度等级约束。例程里一般默认配置是4x @ 5.0Gbps,这对应DSP侧最常见的SRIO配置。联调前务必确认DSP端SRIO端口的链路宽度和速率,两边不一致时物理层会协商失败,现象就是链路反复训练,但始终到不了PORT_OK状态。

参考时钟部分,SRIO IP核通常要求125MHz的差分参考时钟,并且频率精度要求较高,一般是±50ppm以内。最稳妥的做法是使用板上专用的参考时钟芯片输出给FPGA的专用时钟引脚。这个时钟不能随便拿个普通PLL输出代替,掉ppm会导致链路误码率升高,表现为数据偶尔跳变但链路仍然显示up。IP核生成时会输出对应的约束文件,直接添加到工程即可,不需要额外写时钟约束。

共享逻辑(Shared Logic)的集成方式也要在例程里看明白。SRIO IP核允许把GTX Common、复位逻辑等共享资源放在IP内部或外部。例程如果是单核使用,通常选择IP内部共享;如果是多核同时使用(比如4条链路分别接4个DSP),就必须把共享逻辑放到外部,否则会报DRC冲突。这个选择在IP配置界面里要提前规划,例程已经设好,但如果要拷贝到多核工程里,这个选项是要改的。

2.3 例程的顶层结构与DSP端视角

从DSP端的视角看,SRIO就像一段内存映射窗口:DSP向某个地址发起写操作,数据就会出现在FPGA内部某个寄存器或BRAM里;DSP发起读操作,FPGA把对应内容写回响应包。例程的顶层模块通常就是围绕这个模型组织的——一组接收状态机解析DSP发来的请求包,一组发送状态机关联响应包和发起请求的事务号。

真正动手前,我建议先画出数据流图:DSP写请求进来,经过什么模块落到BRAM;DSP读请求进来,从BRAM读到数据后按什么格式组包返回。这套例程在顶层注释里一般会标注各模块职责,比如rx_engine解析包头、mem_if对接BRAM控制器、doorbell_irq产生中断标志。把这些组成和DSP地址窗口对应上,逻辑上就立住了。

3. 例程代码怎么落地:从初始化状态机到第一笔读事务

3.1 一套能跑的例程该有的模块划分

我拆过不少SRIO例程,好用的工程目录结构都差不多。顶层一般叫srio_endpoint_top,内部至少会有这几个部分:IP核例化、请求接收解析模块、响应发送模块、寄存器控制模块、门铃中断模块、BRAM数据缓冲模块。例程里通常还会带一个简单的自测模块,用来做环回验证。初始化状态机则是这套例程的心脏——它负责等待IP核的复位完成、链路训练通过,然后才允许上层发起事务。

模块划分上有两个陷阱要注意。第一,不要把解析逻辑和响应组包逻辑混在同一个状态机里。请求进来需要查地址表决定是写到寄存器还是BRAM,响应组包则需要等待BRAM读出的数据返回,两者工作节奏完全不同,混在一起状态机很容易跑飞。第二,门铃中断要独立成一个模块。它只做一件事:收到DOORBELL包后,解析出16bit的info字段和源ID,锁存起来拉高中断标志。中断标志要在DSP侧写清寄存器后才下降沿清除,否则会丢中断。

3.2 发起一次NREAD:AXI-Stream时序与包格式

例程里,FPGA作为SRIO发起方时(比如主动去读DSP的内存),需要向IP核的发起请求通道写入一个读请求包。以NREAD为例,典型代码结构如下:

// 发起一个NREAD事务:读DSP侧地址 0x1000_0000,请求4字节数据 always @(posedge clk) begin if (init_trigger && fifo_not_full) begin // 通道上先握手,tvalid拉高表示有请求要发送 axis_ireq_tvalid <= 1'b1; // 包类型:NREAD,ftype=2, ttype=4;目标ID是DSP的Device ID axis_ireq_tdata[127:96] <= {8'h22, 8'h04, 16'd100, 16'd1, 16'h0000, 16'h0000}; // 中间字段:destID=100(DSP侧ID),srcID=200(FPGA侧ID) axis_ireq_tdata[95:64] <= {16'd100, 16'd200}; // 低64位:读地址和字节数,这里取8字节对齐 axis_ireq_tdata[63:0] <= {32'h1000_0000, 4'd8, 16'h0000, 4'd0, 8'h00}; axis_ireq_tlast <= 1'b1; end end

这段逻辑的关键点有两个。第一,NREAD请求包的tlast必须和tvalid同时拉高,因为整个请求只有一拍,不需要发送多拍数据。第二,tuser字段里携带了更多协议信息,包括prio(优先级)、ftype(操作类型)、ttype(子类型)、destID等,不同IP版本对tuser的位定义略有差异,务必对照IP核生成的端口说明文档核对。IP核的AXI-Stream接口支持tvalid/tready握手,发送前要检查tready是否拉高,否则数据会滞留。

NREAD的响应不会马上回来。响应通过IP核的响应通道返回,里面带着读到的数据。用户逻辑需要维护一个事务标记(通常是请求的事务ID或目标地址),用来把响应和之前的请求关联起来。例程里常用一个简单的FIFO来暂存请求信息,响应回来时弹出对应项,这样即使多个读请求同时挂起也不会错乱。

3.3 tuser里的玄学:ftype、ttype和地址窗口的对应关系

很多人在例程上翻车,翻在最容易忽略的tuser字段上。AXI-Stream的数据通道上是格式化后的包数据,而tuser通道携带的是控制信息,包括事务ID、优先级、以及关键的包类型标识。SRIO IP核的请求通道tuser位宽通常是32bit左右,其中高16bit是目的ID,低几位是优先级,中间夹杂着读写标志。如果按tuser说明填错了目的ID,包就发不到DSP;填错了事务ID,响应关联就会错乱。

我的一般做法是:在例程源码里找到tuser字段的位定义注释,建立一个parameter常量组,把NREAD、NWRITE、SWRITE、DOORBELL各自对应的tuser固化下来。这样后面写业务逻辑时只引用常量,不直接手填数值,避免每次翻手册。另外提醒一句:DOORBELL包的ftype是0xA,NREAD是0x2,NWRITE是0x6,SWRITE是0xD,这几个十六进制数如果和DSP端的协议栈版本对应不上,联调时会很痛苦。

4. 与DSP联调:寄存器握手、门铃中断和链路状态检查

4.1 链路训练成功再谈数据收发,顺序不能反

SRIO联调最容易犯的错误就是一上来就发读写请求,完全不管物理层准备好了没有。链路训练由硬件自动完成,但用户逻辑必须在初始化状态机里加一道闸门:只有检测到IP核输出的链路状态信号(通常是link_up或port_initialized)拉高后,才允许发起请求。链路状态信号的名称在不同IP版本里略有差异,例程里一般做成了三态输出:复位中、链路未初始化、链路已就绪。

链路训练过程的监测,我用ILA抓过多次,典型的时序是:复位释放后约几百微秒,物理层完成码组同步和通道对齐,然后port_initialized拉高。这个过程中不要去配置SRIO内部寄存器,也不要尝试发送包。如果超过1毫秒链路还没up,基本可以断定是硬件问题,调试软件逻辑没用——大概率是参考时钟频率不对、GTX复位时序异常或者PCB走线问题。

DSP侧上电初始化结束后,两边才能开始真正的数据交互。C6678这类DSP的SRIO初始化过程比较长,包含端口配置、路由表配置和使能操作,通常需要一个固定的等待时间。例程里会在初始化状态机里加一个超时计数器,超时后仍未握手成功就拉一个错误标志,方便联调时定位是FPGA侧没准备还是DSP侧没起来。

4.2 寄存器地址映射表和双向握手协议

例程里最该花时间研究的就是地址映射表。DSP向FPGA的SRIO空间发起读写时,地址的低16位或低20位会传给FPGA端点,内部逻辑根据这段地址决定访问哪个寄存器或哪段BRAM。一套清晰的设计是:把地址空间划分为控制寄存区、状态寄存区和数据缓冲区三个区域。

地址范围(偏移)区域用途示例寄存器
0x0000 - 0x00FF控制寄存器区软件复位、握手使能、中断清除
0x0100 - 0x01FF状态寄存器区版本号、链路状态、错误计数
0x1000 - 0x1FFF数据缓冲BRAM区DSP下发数据和读回数据缓冲区
0x8000 - 0x8001门铃信息寄存器最近一次门铃的info字段和源ID

双向握手协议我建议这样设计:DSP上电后写控制寄存器区的握手使能位为1,同时读取版本号寄存器确认链路通路完好;FPGA检测到握手使能位后,向DSP回一个DOORBELL,info字段填一个约定的魔数(比如0x5A5A);DSP收到该门铃后确认通信建立,再进入正常业务。这套流程虽然多了一个握手步骤,但能避免后续大量「我发了你收到了吗」的无效排查。例程里一般会实现握手逻辑的主体,你要做的是把地址偏移和门铃魔数改成和自己的板卡匹配的值。

4.3 用ILA抓包定位收发卡在哪个环节

联调最实用的排查工具就是ILA(集成逻辑分析仪)。SRIO例程在Vivado里综合后,把需要观测的信号加入ILA探针,再重新综合擦写FPGA。一个标准的抓包配置是:抓IP核的用户接口信号——发起请求通道axis_ireq_*和响应接收通道axis_iresp_*,同时抓链路状态信号和门铃中断信号。触发条件设置为链路状态拉高后的第一个发送包,可以直观看到DV从哪一拍开始拉高、tvalid/tready是否在正确握手。

如果ILA抓到发起请求通道上有tvalid拉高但tready一直为低,说明IP核内部FIFO已满或尚未就绪。这种情况通常是往IP核灌包太猛、超过了链路能承载的速率,需要在用户逻辑里加背压控制。如果抓ISP通道上有响应tvalid拉高但用户逻辑没读取,要检查响应通道的接收状态机是否进入了错误状态。ILA抓到的包内容要和协议文档里的包格式做对比,尤其是字节序和包头字段的bit排列——SRIO协议是大端序,这和很多工程师熟悉的Axi小端序相反,最容易看走眼。

4.4 移植到自己的板卡:换芯片型号后要重新生成的配置

例程往往基于某一种具体型号的FPGA芯片,移植到别的型号时,直接改动是不够的。IP核必须重新配置和生成,因为GTX/GTH的参考时钟结构、速度等级对应的线速率范围都不同。举例来说,K7系列常用GTX,V7系列部分型号用GTH,两者在IP配置界面的选项不一样。IP核重新生成后,要检查约束文件里的位置约束是否需要更新,特别是GTX的位置如果是手动指定的,换芯片后位置号会变。

换芯片后另一件必须检查的事是复位逻辑。GTX的复位顺序由一个gt_rxresetfsm和gt_txresetfsm统一管理,例程里已经例化好了。但如果换的芯片封装不同、参考时钟引脚位置变化,复位完成信号可能不再0满足时序,需要核对参考时钟的到达时间和GTX复位释放的先后关系,必要时在复位状态机里加一个固定延时。这个坑我踩过一次——换了封装后链路时好时坏,最后定位到是GTX复位释放快了两个时钟周期。

5. 避坑记录:链路不up、数据错位、读超时和门铃失联

5.1 链路一直训练不到PORT_OK,问题在参考时钟和GT复位

现象:FPGA侧链路状态信号反复拉高拉低,或始终停在未初始化状态,DSP侧也检测不到对端。

原因:最常见的是参考时钟质量不达标,或者GTX共享逻辑的复位没有正确释放。还有一个隐蔽原因:IP核生成时选择了「共享逻辑在外部」,但例化时没有正确连接外部GT common原语。

解决:先测参考时钟,如果频率偏移超过50ppm直接换时钟源。再用IBERT核做纯物理层测试,绕过逻辑层验证GTX通道收发是否正常。如果IBERT显示误码率正常但协议层链路就是不up,检查复位模块中gt_txresetdone和gt_rxresetdone信号是否拉高,两个done都拉高后再释放IP核内部复位。

5.2 批量写数据偶发错位或丢失,超过最大payload是一切的根源

现象:DSP向FPGA连续写大块数据,比如一次写64KB,数据接收后出现部分数据区域对不上,有时是整段丢失。

原因:SRIO单包最大payload为256字节,超过这个长度必须拆包。DSP侧驱动通常会自动拆包,但拆包粒度是256、128还是64由双方协商决定。FPGA侧接收逻辑如果没有按包边界正确处理,遇到拆包后的多包事务就会错位。另一个隐蔽原因是AXI-Stream的tkeep信号没有正确传递,导致数据有效字节错位。

解决:确认IP核配置里的Max Payload Size,和DSP侧保持一致的设置。接收逻辑按tlast将一个完整事务和下一个事务分开,FIFO写入时用tkeep控制有效字节。如果例程里接收逻辑用了一个简单的计数器来写BRAM,一定要加上包头解析得到的事务总长度作为计数基准。

5.3 NREAD发出去后响应迟迟不来,先查响应通道的FIFO阻塞

现象:DSP通过SRIO读FPGA内存,FPGA侧收到的NREAD请求是正常的,但DSP侧超时。

原因:FPGA作为SRIO目标端时,收到读请求后需要构造响应包并通过axis_iresp通道回给IP核。响应通道通常有一级FIFO缓冲,如果上层逻辑读取不及时,FIFO积压后请求压满,新的请求就进不来。

解决:用ILA同时观察axis_iresp通道的tvalid和tready。如果tvalid一直拉高且tready为低,说明响应方向堵塞;如果tvalid根本没拉高,说明请求解析或数据读取逻辑卡住了。很多情况下是BRAM读使能信号没有正确触发,去检查读请求状态机是否在等一个永远等不到的空闲信号。

5.4 门铃丢了或者收到内容不对,问题在中断清除方式和info位段

现象:DSP发门铃,FPGA侧中断偶尔不触发,或者两次门铃信息覆盖成了同一次内容。

原因:门铃包到达后,中断标志直接拉高,用户逻辑在中断服务里读取信息寄存器后立即清除中断,但SRIO IP核的事件状态寄存器还没完成状态更新,导致第二次门铃来的时候中断标志没有被正确置位。

解决:中断清除流程改为「锁存信息 → 清除IP核事件寄存器 → 延迟几个周期 → 清除内部标志」。门铃的info字段只有16bit,解析时按位段取用,不能整个读出来当32bit去比较。例程里如果写死了某个参考值,记得改成两边约定的魔数,否则门铃通了但校验失败也会被视为中断丢失。

5.5 DSP把FPGA配成目标但FPGA没映射,维护事务被误当成普通请求

现象:链路正常、握手正常,但DSP读取某些SRIO维护寄存器(比如标准错误状态寄存器)时拿到的数据全为0。

原因:FPGA侧逻辑只解析了NREAD/NWRITE等内存事务,维护事务(Maintenance)的ftype是0x8,被接收状态机按未知类型丢掉了。

解决:在接收解析逻辑里增加对ftype=0x8分支的处理。常见做法不是真正实现维护事务处理,而是直接返回一个「成功完成」的响应包,响应数据填0或填一个固定的版本号。DSP侧配置SRIO端口时很多主机端软件会先扫一遍对端ID,如果维护事务无响应,可能认为链路不存在而放弃初始化。

6. 把例程吃透:用IBERT和ILA做链路体检与带宽压测

拿到例程跑通业务逻辑只是第一步,我习惯再补两项验证:链路裕量体检和真实带宽压测。前者用Xilinx的IBERT核直接在物理层测眼图和误码率,后者用改造后的例程逻辑灌满链路数据统计吞吐。

IBERT的用法是新建一个顶层工程,把SRIO IP核替换成IBERT核,选同样的线速率和通道数,综合后上板测。重点看每个GTX通道的眼图张度和误码率,如果眼图闭合严重或者误码率在1e-12以上,说明物理层裕量不够,数据收发会随着温度漂移而偶发出错。IBERT验证通过后再换回SRIO例程逻辑,能排除掉绝大多数物理层玄学问题。

带宽压测的做法是写一个简单的测试逻辑:初始化完成后,FPGA循环向DSP侧发SWRITE事务(SWRITE无需响应,吞吐最高),每到一定字节数累加一个计数器,同时用定时器计算实际速率。把速率和线速率理论值对比:4x @ 5.0Gbps的理论单向带宽约2.0GB/s(扣除编码和协议开销后实际大约1.2GB/s左右)。如果测出来的实际速率明显偏低,接着用ILA统计每笔事务的时间开销——常见瓶颈是两笔SWRITE之间间隔过长,需要在上一笔事务tlast确认后再启动下一笔事务,而不是等到响应或固定延时后才发。

从那以后我每次上手新的SRIO工程,都会强制自己先走这套流程:例程跑通 → IBERT测裕量 → 压测拿实际带宽曲线 → 再谈业务逻辑。链路裕量这东西,数据很诚实的,早测早安心。希望这篇拆解能帮你把SRIO的坑填掉一大半。

本文还有配套的精品资源,点击获取

需要专业的网站建设服务?

联系我们获取免费的网站建设咨询和方案报价,让我们帮助您实现业务目标

立即咨询