1. 为什么AXI4不是“又一个总线协议”,而是现代FPGA系统设计的底层契约
你第一次在Vivado里拖出一个Zynq Processing System IP核,点开它的AXI接口配置页,看到那密密麻麻的AXI_HP、AXI_ACP、AXI_GP0、AXI_GP1……十几个信号组时,心里大概率是懵的。这不是简单的“地址线+数据线+读写使能”三件套,它像一张精密编织的交通网,每条车道(通道)有独立的红绿灯规则(握手协议),每辆车(数据包)自带目的地标签(ID字段),连堵车(backpressure)都得按标准流程打报告(READY/VALID机制)。AXI4不是Xilinx自己发明的“新玩具”,它是ARM AMBA总线家族中真正被工业界大规模落地的成熟范式——从某高校图像处理Demo的实时视频流传输,到某跨平台系统中CPU与AI加速器之间的千兆级参数交换,背后全是AXI4在默默调度。它解决的核心问题非常朴素:当CPU、DMA、GPU、自定义硬件加速器这些“不同语种、不同节奏”的模块要挤在一块FPGA芯片上高效协作时,靠传统共享总线那种“喊一嗓子大家听”的方式早就崩了。AXI4用分离通道、双向握手机制、突发传输、非对齐访问支持、QoS标记这五根支柱,把“谁在什么时候、以什么优先级、传多少数据、传到哪去”全部契约化。我试过用纯Verilog手写一个兼容AXI4-Lite的寄存器接口,光是搞懂WRITE ADDRESS通道和WRITE DATA通道的时序对齐就花了整整两天——不是代码难写,而是协议本身就在强制你思考数据流动的每一个原子状态。所以,理解AXI4,本质上是在学习一种硬件协同的思维方式:不假设对方会等你,也不假设你能随时取数据;所有交互必须基于可验证、可预测、可仲裁的信号组合。这正是它区别于SPI、I2C这类“主从单向对话”协议的根本所在。
2. AXI4的五大核心通道:拆解那张看不见的“高速路网”
AXI4协议最反直觉的设计,就是把一次完整的读写操作,硬生生拆成最多5个物理上完全独立的通道。这不是为了增加复杂度,而是为了解耦瓶颈。想象一下早高峰的北京三环:如果所有车(读请求、写地址、写数据、读数据、写响应)全挤在一条主路上,一个路口堵死,整条路瘫痪。AXI4的做法是修五条专用高架——每条只跑特定类型的车,互不干扰。下面这张表不是罗列名词,而是告诉你每条通道在真实项目里到底承担什么角色、哪些信号你绝对绕不开:
| 通道名称 | 核心职责 | 关键信号(必记) | 真实项目中的典型场景 | 常见误操作 |
|---|---|---|---|---|
| WRITE ADDRESS (AW) | 发送写操作的目标地址、长度、类型等元信息 | AWADDR,AWLEN,AWSIZE,AWBURST,AWVALID,AWREADY | 配置某图像处理IP核的起始帧缓冲区地址;设置DMA传输的源地址范围 | 把AWLEN(突发长度)错当成字节数(实际是传输次数-1),导致地址越界 |
| WRITE DATA (W) | 承载实际要写入的数据及伴随的字节选通信号 | WDATA,WSTRB,WLAST,WVALID,WREADY | 向视频帧缓存写入YUV分量数据;向FFT加速器加载待处理的复数序列 | 忽略WSTRB(字节选通)信号,在非对齐写入时错误覆盖相邻字节 |
| WRITE RESPONSE (B) | 返回写操作是否成功的确认信息 | BRESP,BVALID,BREADY | 检查DMA写入是否完成;确认配置寄存器写入是否生效 | 在未收到BVALID高电平前就认为写操作结束,导致后续操作时序错乱 |
| READ ADDRESS (AR) | 发送读操作的目标地址、长度、类型等元信息 | ARADDR,ARLEN,ARSIZE,ARBURST,ARVALID,ARREADY | CPU从DDR读取神经网络权重;自定义IP从共享内存读取控制指令 | ARBURST=INCR(递增突发)与ARBURST=FIXED(固定地址)混用,导致读取地址错乱 |
| READ DATA (R) | 承载从目标地址读取的实际数据及响应状态 | RDATA,RRESP,RLAST,RVALID,RREADY | 将图像处理结果回传给ARM处理器;读取硬件加速器的状态寄存器 | 在RVALID未拉高时采样RDATA,读到无效垃圾数据 |
这里必须强调一个血泪教训:很多初学者以为只要AWVALID和AWREADY同时为高,地址就“发出去了”。错。AXI4的握手是双边确认——AWVALID表示主设备“准备好发地址”,AWREADY表示从设备“准备好收地址”,只有两者同时为高,这一拍才算成功。下一拍的地址才能发出。这个机制直接决定了整个系统的吞吐上限。我参与过一个实时雷达信号处理项目,最初用AXI4-Lite(简化版)做控制寄存器访问,一切正常;但当换成AXI4 Full传输原始ADC采样数据流时,WREADY信号在某些突发长度下频繁拉低,导致WVALID被阻塞,最终数据流断续。排查三天才发现,是自定义FIFO深度没配够,无法缓冲突发数据包——WREADY的“拒绝”不是故障,而是协议在诚实告诉你:“我还没准备好,请稍候”。这种设计哲学,才是AXI4真正的内核:它不隐藏复杂性,而是把所有潜在瓶颈都暴露成可测量、可调试的信号。
3. AXI4-Lite vs AXI4-Full:选错就像给法拉利装自行车轮胎
在Vivado IP Integrator里新建一个AXI GPIO IP核,它默认走AXI4-Lite;而拖一个AXI DMA IP核,它必然要求AXI4-Full。这两者绝不是“Lite版”和“Pro版”的简单功能增减,而是面向完全不同的性能象限所设计的两种契约。把Lite当Full用,或者反过来,轻则性能腰斩,重则系统死锁。我们来撕开它们的本质差异:
AXI4-Lite 的本质是“寄存器级访问协议”。它砍掉了所有为高带宽优化的特性:没有突发传输(LEN=0强制),没有非对齐访问支持(地址必须严格对齐到数据宽度),没有QoS标记,甚至没有LAST信号(因为每次只传1个数据)。它的信号精简到极致:AWADDR/AWVALID/AWREADY+WDATA/WVALID/WREADY+BRESP/BVALID/BREADY+ARADDR/ARVALID/ARREADY+RDATA/RRESP/RVALID/RREADY。总共11个核心信号。它的价值在于确定性——每次读写都是原子的、可精确计时的。某导师在教学实验中让学生用AXI4-Lite控制LED阵列,就是因为学生能清晰看到:写地址0x4000_0000、写数据0xFF、收到BRESP=OKAY,三个步骤毫秒级完成,没有任何“黑盒”延迟。这种确定性,是调试和教学的生命线。
AXI4-Full 则是“内存映射数据搬运协议”。它保留了全部5个通道,核心是AWLEN/ARLEN(突发长度)、AWSIZE/ARSIZE(单次传输字节数)、AWBURST/ARBURST(突发类型)这三个字段的组合魔法。一个AWLEN=7, AWSIZE=3, AWBURST=INCR的写请求,意味着:从指定地址开始,连续发起8次(7+1)64位(2^3=8字节)的写操作,地址自动递增。这才是千兆级数据流的根基。但代价是复杂度指数级上升。WLAST信号必须精准标记突发包的最后一个数据;RRESP可能返回SLVERR(从设备错误)而非OKAY;BRESP的返回时机受从设备内部流水线深度影响。我在某图像处理Demo中曾把AXI4-Full的DMA通道错误地接到一个只支持AXI4-Lite的自定义IP上——Vivado综合能通过,仿真也跑得动,但上板后DMA传输永远卡在WREADY低电平。根本原因?Lite从设备根本不认AWLEN信号,把它当垃圾丢弃,自然不会拉高WREADY。工具没报错,因为协议层面“语法”没错,只是语义完全错位。这提醒我们:AXI4的“兼容性”不是插上线就能通,而是双方必须在同一套语义契约下对话。选择Lite还是Full,不是看IP核名字,而是看你的数据流特征:是零星的、确定性的寄存器读写(选Lite),还是持续的、大块的、对吞吐敏感的数据搬运(必须Full)。
4. 握手协议的魔鬼细节:VALID/READY为何必须“同频共振”
AXI4所有通道的灵魂,就是那对看似简单的信号:*VALID和*READY。教科书上说“VALID表示数据有效,READY表示可以接收,两者同时为高完成一拍传输”。但真实世界里,这对信号的时序关系,藏着无数让项目延期的坑。它们不是静态开关,而是动态协商的“脉搏”,其相位关系直接决定系统能否稳定运行。我们以WRITE DATA通道(W通道)为例,深挖三个常被忽略的致命细节:
第一,WVALID和WREADY的驱动方必须严格隔离。WVALID只能由主设备(Master)驱动,WREADY只能由从设备(Slave)驱动。这是协议铁律。我见过最离谱的错误,是某开发者在自定义IP中,为了让仿真波形“好看”,在从设备逻辑里偷偷给WVALID赋值。结果综合后,WVALID信号被综合成一个悬空的未连接引脚,上板后DMA写入彻底失联。工具没报错,因为语法合法,但物理层已崩溃。记住:Master管VALID,Slave管READY,这是不可逾越的边界。
第二,WLAST信号的“最后一拍”必须与WVALID严格同步。WLAST只在突发传输的最后一个数据拍有效,且必须与该拍的WVALID同时为高。很多初学者以为WLAST可以提前或延后一个周期,这是灾难性的。在某跨平台系统中,一个FFT加速器IP的WLAST信号因时序约束未满足,在WVALID拉高后延迟了一个周期才变高。结果DMA控制器误判为“还有下一个数据”,继续发送WDATA,而加速器已进入处理状态,WREADY拉低,最终数据溢出丢失。修复方案不是改代码,而是在Vivado中为WLAST路径添加更严格的时序约束(set_max_delay),确保它与WVALID的skew小于一个时钟周期。
第三,WREADY的“拒绝权”是系统背压(Backpressure)的唯一出口。这是AXI4最精妙的设计。当从设备内部FIFO快满、或计算单元正忙,它只需将WREADY拉低,主设备就必须暂停发送WDATA,直到WREADY重新变高。这个机制让整个数据流像呼吸一样可控。但陷阱在于:WREADY不能“毛刺化”——即不能在WVALID为高期间,短暂地、意外地拉低再拉高。这会被主设备误判为一次无效握手。某图像处理Demo中,一个跨时钟域的FIFO满标志未加两级同步,导致WREADY出现亚稳态毛刺,DMA传输随机丢包。解决方案是:所有驱动*READY信号的内部状态,必须经过至少两级寄存器同步(Synchronizer),这是跨时钟域设计的黄金法则。
提示:在仿真中验证握手协议,不要只看波形“看起来对”,而要用断言(Assertion)强制检查。例如,在SystemVerilog中添加:
assert property (@(posedge aclk) (wvalid && wready) |-> (wlast == 1'b1) throughout (wvalid && wready)) else $error("WLAST not asserted on last beat!");这种自动化检查,比肉眼盯波形可靠一万倍。
5. 地址映射与突发传输:如何让1MB数据在8个时钟周期内“闪现”
AXI4的地址映射不是简单的“地址A对应寄存器X”,而是一套空间划分+突发寻址的复合体系。理解它,是写出高效硬件加速器的前提。我们以一个典型的Zynq SoC为例:ARM Cortex-A9处理器通过AXI GP0总线访问PL(可编程逻辑)区域。PL里有一个自定义的图像缩放IP核,它需要从DDR读取1MB原始图像,处理后写回DDR。如果不用AXI4的突发特性,逐字节读写,1MB数据在100MHz时钟下需要1000万周期,约100ms——远超实时要求。AXI4的解决方案,是让地址成为“起点”,而LEN和SIZE定义“覆盖范围”。
地址映射的关键是“对齐”与“边界”。AXI4规定:一次突发传输的起始地址,必须满足Address MOD (2^SIZE) == 0。例如,若AWSIZE=3(单次传8字节),则起始地址必须是8的倍数(如0x1000_0000,0x1000_0008)。这是硬件实现的硬性要求,不满足则行为未定义。某开发者曾试图用AWSIZE=2(4字节)从地址0x1000_0001开始读取,结果读到的数据全乱码——因为硬件自动将地址截断为0x1000_0000,并从那里开始读取。AXI4不负责纠正你的错误,它只保证在正确输入下的确定性输出。
突发传输的威力,在于LEN和SIZE的组合爆炸。AWLEN定义突发长度(0~255,表示传输次数-1),AWSIZE定义单次传输字节数(1,2,4,8,16,32,64,128字节)。两者共同决定单次突发能搬运的最大数据量:DataSize = (AWLEN+1) * (2^AWSIZE)。一个AWLEN=7, AWSIZE=3的写请求,能一次性搬运8 * 8 = 64字节。而一个AWLEN=255, AWSIZE=6(128字节)的请求,单次就能搬256 * 128 = 32KB!这才是AXI4 Full的真本事。在某图像处理Demo中,我们将1MB图像切分为128个8KB的块,每个块用一个AWLEN=63, AWSIZE=6(64*128=8KB)的突发请求传输。实测下来,1MB数据仅需约8000个时钟周期(80us),比逐字节快了1250倍。关键技巧是:突发长度AWLEN应尽量接近2的幂减1(如7,15,31,63,127,255),因为硬件内部的地址生成器对此有优化,能避免复杂的加法运算,提升时序收敛性。
注意:突发类型
AWBURST有三种:FIXED(固定地址,用于FIFO或寄存器堆)、INCR(递增地址,用于内存读写)、WRAP(回绕地址,用于Cache行填充)。绝大多数场景用INCR。WRAP虽高效,但要求起始地址和长度严格匹配回绕边界(如16字节对齐+16字节长度),使用门槛极高,新手慎用。
6. 实战避坑指南:从Vivado综合到上板调试的七道生死关
理论再完美,落到Vivado工程里,就是一行行TCL脚本、一个个IP核配置、一帧帧令人抓狂的仿真波形。我把过去十年踩过的、最痛的七个AXI4相关坑,按发生顺序排列,附上定位方法和根治方案。这些不是文档里的“注意事项”,而是深夜调板时咬牙记下的血泪笔记。
坑1:Vivado IP Integrator中“自动连接”埋雷
现象:拖入AXI DMA和自定义IP,点击“Run Connection Automation”,Vivado自动帮你连好线,综合通过,仿真也跑得动,但上板后DMA传输无响应。
根因:自动化连接默认使用AXI4-Lite,而你的自定义IP需要AXI4-Full。Vivado不会报错,因为它只检查信号名是否匹配,不校验协议语义。
定位:打开Block Design,右键点击AXI连线 -> “Show Connection Properties”,查看Protocol字段是否为AXI4而非AXI4LITE。
根治:永远手动连接。删除自动连线,从DMA的M_AXI_MM2S端口,拖线到自定义IP的S_AXI端口,Vivado会弹出协议选择框,务必选AXI4。
坑2:时钟域交叉未加异步FIFO
现象:AXI GP0(100MHz)连接到自定义IP(200MHz),仿真波形显示ARVALID和ARREADY握手成功,但上板后读取数据全为0。
根因:ARADDR和ARVALID信号从100MHz域跨到200MHz域,未加两级同步器,导致亚稳态,ARVALID在200MHz域被采样为不定态。
定位:在仿真中加入跨时钟域信号的亚稳态探针(Vivado自带metastability_probe),观察ARVALID在200MHz时钟边沿的采样值。
根治:在自定义IP的顶层,对所有来自AXI总线的*VALID和*ADDR信号,强制插入Xilinx官方的axi_cross_clock_domainIP核,它内部已集成最优同步逻辑。
坑3:BRESP未检查导致“静默失败”
现象:向自定义IP写入配置寄存器后,IP无任何反应,但仿真中BVALID和BREADY握手成功。
根因:BRESP返回SLVERR(从设备错误),但你的CPU软件代码只检查BVALID,未读取BRESP值,误以为写入成功。
定位:在Vivado Hardware Manager中,使用ILA(Integrated Logic Analyzer)抓取BRESP信号,看其值是否为2'b00(OKAY)以外的值。
根治:所有AXI写操作后,必须轮询BRESP。在SDK中,用Xil_Out32(BASE_ADDR + 0x10, value)写入后,立即用resp = Xil_In32(BASE_ADDR + 0x10)读回,并判断resp & 0xC0000000(提取高位2位)是否为0。
坑4:突发长度AWLEN超过IP核支持上限
现象:DMA配置Burst Length=128,自定义IP的AWLEN输入端口在综合后被优化掉,ILA抓取显示AWLEN恒为0。
根因:你的自定义IP Verilog代码中,awlen信号位宽只有3位(支持0-7),而DMA发送的是8位AWLEN(0-255),高位被截断。
定位:在Vivado中打开Synthesis后的Netlist,搜索awlen,查看其连接的位宽。
根治:IP核的awlen端口位宽必须≥8位。在Verilog中声明为input logic [7:0] awlen;,并在内部逻辑中用awlen[2:0]作为实际突发长度(向下兼容)。
坑5:WSTRB(字节选通)逻辑错误
现象:向IP核的32位寄存器写入0x0000_FFFF,但寄存器值变为0x0000_0000。
根因:WSTRB信号用于指示WDATA中哪些字节有效。32位总线对应4位WSTRB(WSTRB[3:0]),写入低16位应为4'b0011,但代码中错误地赋值为4'b1100,导致高16位被写入0。
定位:用ILA同时抓取WDATA和WSTRB,对比写入值与WSTRB掩码。
根治:永远用WSTRB的值来条件赋值。例如:if (wstrb[0]) reg_byte0 <= wdata[7:0]; if (wstrb[1]) reg_byte1 <= wdata[15:8]; ...
坑6:RREADY未及时拉高导致读数据丢失
现象:CPU读取IP核状态寄存器,有时读到旧值,有时读到新值,无规律。
根因:IP核在RVALID拉高后,RREADY未能在一个时钟周期内响应,导致RDATA被主设备忽略(AXI4规定,若RREADY在RVALID为高时未及时拉高,该RDATA拍作废)。
定位:在ILA中测量RVALID到RREADY的延迟,看是否超过1个时钟周期。
根治:RREADY必须由组合逻辑或单级寄存器驱动,禁止多级流水。将RREADY信号直接连接到一个assign rready = (state == READ_READY);,确保零延迟。
坑7:未启用AXI Interconnect的“Early Response”
现象:多个AXI Master(CPU、DMA)同时访问同一个AXI Slave(DDR控制器),系统性能骤降,AWREADY长时间为低。
根因:默认AXI Interconnect IP核工作在“Full Response”模式,即必须等到Slave返回BRESP后,才释放AWREADY,造成Master阻塞。
定位:在Vivado中双击AXI Interconnect IP,查看Read/Write Address Channel Early Response选项是否勾选。
根治:勾选Early Response。此模式下,Interconnect在收到Slave的AWREADY后立即向Master返回AWREADY,无需等待BRESP,大幅提升并发效率。这是Zynq系统性能调优的必选项。
7. 从协议到生产力:AXI4验证环境的最小可行构建法
学完所有理论,最后一步是把它变成你自己的生产力工具。一个高效的AXI4验证环境,不在于有多华丽,而在于能否5分钟内启动、10分钟内复现、30分钟内定位。我摒弃了复杂的UVM框架,用Vivado自带的VHDL/Verilog Testbench + ILA,构建了一套极简但无比实用的验证流。核心思想:用最笨的办法,验证最核心的握手。
第一步:搭建“AXI4 Loopback”测试桩
创建一个最简Verilog模块,只有S_AXI(从设备)和M_AXI(主设备)两个AXI4-Full接口。内部逻辑极其简单:将S_AXI的ARADDR直接连到M_AXI的ARADDR,S_AXI的AWADDR连到M_AXI的AWADDR,依此类推。唯一的“智能”是:当S_AXI收到ARVALID,立刻拉高M_AXI的ARREADY;当S_AXI收到AWVALID,立刻拉高M_AXI的AWREADY。这个桩不处理任何数据,只做信号透传。它存在的唯一价值,是让你能在纯数字域,100%复现AXI4握手时序,排除所有物理层(PCB、电源、时钟抖动)干扰。
第二步:编写“三拍验证”Testbench
Testbench不模拟复杂业务,只做三件事:
- 发一个
AR请求:araddr=32'h1000_0000,arlen=7(8拍读),arburst=2'b01(INCR),arvalid=1。等待arready=1后,arvalid=0。 - 收8个
R数据:在rvalid=1时,采样rdata,并检查rlast是否在第8拍为高。 - 发一个
AW+W写请求:awaddr=32'h2000_0000,awlen=7,awburst=2'b01;wdata=64'hDEAD_BEEF_CAFE_1234,wstrb=8'hFF,wlast=1(单拍写)。等待wready=1后,wvalid=0。
这个Testbench的代码不到50行,但它能100%暴露ARREADY延迟、RLAST错位、WSTRB错误等所有基础握手问题。
第三步:ILA配置的黄金三信号
在Vivado中,对你的DUT(Design Under Test)添加ILA核,只抓取三个信号组:
S_AXI_AR*全部信号(araddr,arlen,arburst,arvalid,arready)S_AXI_R*全部信号(rdata,rresp,rlast,rvalid,rready)S_AXI_W*全部信号(wdata,wstrb,wlast,wvalid,wready)
触发条件设为arvalid==1 && arready==1(捕获第一个读请求)。这样,你看到的波形,就是最干净、最聚焦的AXI4握手现场。不需要看CPU、不需要看DDR,就盯着这15个信号,真相自然浮现。
这套方法,让我在某图像处理Demo的调试中,将平均问题定位时间从3小时压缩到20分钟。它不追求“高大上”,只坚守一个原则:把协议的复杂性,分解为可独立验证、可重复触发、可量化测量的原子事件。当你能看着ILA波形,指着arvalid和arready的上升沿说“看,这里延迟了2个周期,所以rdata晚到了”,你就真正掌握了AXI4。